Target
Dipeptidyl peptidase 4
Ligand
BDBM106759
Substrate
Meas. Tech.
In vitro DPP IV enzyme inhibition assay
Temperature
310.15±n/a K
IC50
2.5e+3±n/a nM
Comments
extracted
Citation
 Sharma, MGupta, MSingh, DKumar, MKaur, P Synthesis, evaluation and molecular docking of prolyl-fluoropyrrolidine derivatives as dipeptidyl peptidase IV inhibitors. Chem Biol Drug Des 82:156-66 (2013)  
Target
Name:
Dipeptidyl peptidase 4
Synonyms:
ADABP Adenosine deaminase complexing protein 2 CD_antigen=CD26 DPP4 DPPIV Dipeptidyl peptidase 4 (DPP IV) Dipeptidyl peptidase 4 (DPP4) Dipeptidyl peptidase 4 membrane form Dipeptidyl peptidase IV Dipeptidyl peptidase IV (DDP-IV) Dipeptidyl peptidase IV membrane form Dipeptidyl peptidase-IV (DPP-4) T-cell activation antigen CD26 | TP103
Type:
Enzyme
Mol. Mass.:
88271.01
Organism:
Homo sapiens (Human)
Description:
P27487
Residue:
766
  
Inhibitor
Name:
BDBM106759
Synonyms:
(2S)‐2‐amino‐3‐methyl‐1‐(1,3‐thiazolidin‐3‐ yl)pentan‐1‐one | P32/98
Type:
Small organic molecule
Emp. Form.:
C9H18N2OS
Mol. Mass.:
202.317
SMILES:
CCC(C)[C@H](N)C(=O)N1CCSC1
: