Target
Induced myeloid leukemia cell differentiation protein Mcl-1 [172-327]
Ligand
BDBM50400183
Substrate
Meas. Tech.
ITC experiments
pH
8±0
Temperature
298.15±0 K
Kd
1.350e+6±n/a nM
Citation
 Zhang, ZZhao, YSong, TLiu, YLi, XSu, PXie, S Study of binding thermodynamics in the optimization of BH3 mimetics. Chem Biol Drug Des 82:394-400 (2013)  
Target
Name:
Induced myeloid leukemia cell differentiation protein Mcl-1 [172-327]
Synonyms:
BCL2L3 MCL1 Mcl-1 (aa 172-327) | Mcl-1 (residues 172-327)
Type:
Mol. Mass.:
17768.02
Organism:
Homo sapiens (Human)
Description:
Q07820[172-327]
Residue:
156
  
Inhibitor
Name:
BDBM50400183
Synonyms:
Purpuro (Ligand 1) | XANTHOPURPURIN
Type:
Small organic molecule
Emp. Form.:
C14H8O4
Mol. Mass.:
240.2109
SMILES:
Oc1cc(O)c2C(=O)c3ccccc3C(=O)c2c1
: