Target
Prostaglandin E2 receptor EP4 subtype
Ligand
BDBM119452
Substrate
Meas. Tech.
Radioligand Binding Assay:
pH
7.4±n/a
Ki
26±n/a nM
Citation
 Spyvee, MSatoh, TCarlson, JE Pharmaceutical composition US Patent  US8686018 Publication Date 4/1/2014 
Target
Name:
Prostaglandin E2 receptor EP4 subtype
Synonyms:
PE2R4_HUMAN PGE2 receptor EP4 subtype PTGER4 Prostanoid EP4 receptor
Type:
Enzyme
Mol. Mass.:
53134.53
Organism:
Homo sapiens (Human)
Description:
P35408
Residue:
488
  
Inhibitor
Name:
BDBM119452
Synonyms:
US8686018, 111
Type:
Small organic molecule
Emp. Form.:
C22H19F4N3O4
Mol. Mass.:
465.3976
SMILES:
C[C@H](NC(=O)c1c(nn(C)c1Oc1cccc(c1)C(F)F)C(F)F)c1ccc(cc1)C(O)=O
: