Target
Prephenate dehydrogenase
Ligand
BDBM119876
Substrate
Meas. Tech.
Enzyme Assays
Ki
78±6 nM
Citation
 Bryk, RArango, NMaksymiuk, CBalakrishnan, AWu, YTWong, CHMasquelin, THipskind, PLima, CDNathan, C Lipoamide channel-binding sulfonamides selectively inhibit mycobacterial lipoamide dehydrogenase. Biochemistry 52:9375-84 (2013)  
Target
Name:
Prephenate dehydrogenase
Synonyms:
Prephenate dehydrogenase TyrA (PDH) tyrA
Type:
Protein
Mol. Mass.:
33096.86
Organism:
Mycobacterium tuberculosis H37Rv
Description:
O69721
Residue:
323
  
Inhibitor
Name:
BDBM119876
Synonyms:
SL932 | US9073941, 503
Type:
Small organic molecule
Emp. Form.:
C15H16BrClN4O4S
Mol. Mass.:
463.734
SMILES:
COc1ccc(NC(=O)CN(C)S(=O)(=O)c2cc(Br)cnc2N)cc1Cl
: