Target
Prephenate dehydrogenase
Ligand
BDBM119877
Substrate
Meas. Tech.
Enzyme Assays
Ki
155±12 nM
Citation
 Bryk, RArango, NMaksymiuk, CBalakrishnan, AWu, YTWong, CHMasquelin, THipskind, PLima, CDNathan, C Lipoamide channel-binding sulfonamides selectively inhibit mycobacterial lipoamide dehydrogenase. Biochemistry 52:9375-84 (2013)  
Target
Name:
Prephenate dehydrogenase
Synonyms:
Prephenate dehydrogenase TyrA (PDH) tyrA
Type:
Protein
Mol. Mass.:
33096.86
Organism:
Mycobacterium tuberculosis H37Rv
Description:
O69721
Residue:
323
  
Inhibitor
Name:
BDBM119877
Synonyms:
SL809 | US9073941, 502
Type:
Small organic molecule
Emp. Form.:
C16H19BrN4O5S
Mol. Mass.:
459.315
SMILES:
COc1ccc(NC(=O)CN(C)S(=O)(=O)c2cc(Br)cnc2N)cc1OC
: