Target
Prephenate dehydrogenase
Ligand
BDBM119879
Substrate
Meas. Tech.
Enzyme Assays
Ki
289±9 nM
Citation
 Bryk, RArango, NMaksymiuk, CBalakrishnan, AWu, YTWong, CHMasquelin, THipskind, PLima, CDNathan, C Lipoamide channel-binding sulfonamides selectively inhibit mycobacterial lipoamide dehydrogenase. Biochemistry 52:9375-84 (2013)  
Target
Name:
Prephenate dehydrogenase
Synonyms:
Prephenate dehydrogenase TyrA (PDH) tyrA
Type:
Protein
Mol. Mass.:
33096.86
Organism:
Mycobacterium tuberculosis H37Rv
Description:
O69721
Residue:
323
  
Inhibitor
Name:
BDBM119879
Synonyms:
SL917 | US9073941, 505
Type:
Small organic molecule
Emp. Form.:
C17H21BrN4O3S
Mol. Mass.:
441.343
SMILES:
CC(C)c1ccc(NC(=O)CN(C)S(=O)(=O)c2cc(Br)cnc2N)cc1
: