Target
Prephenate dehydrogenase
Ligand
BDBM119880
Substrate
Meas. Tech.
Enzyme Assays
Ki
333±28 nM
Citation
 Bryk, RArango, NMaksymiuk, CBalakrishnan, AWu, YTWong, CHMasquelin, THipskind, PLima, CDNathan, C Lipoamide channel-binding sulfonamides selectively inhibit mycobacterial lipoamide dehydrogenase. Biochemistry 52:9375-84 (2013)  
Target
Name:
Prephenate dehydrogenase
Synonyms:
Prephenate dehydrogenase TyrA (PDH) tyrA
Type:
Protein
Mol. Mass.:
33096.86
Organism:
Mycobacterium tuberculosis H37Rv
Description:
O69721
Residue:
323
  
Inhibitor
Name:
BDBM119880
Synonyms:
SL418
Type:
Small organic molecule
Emp. Form.:
C14H13BrClFN4O3S
Mol. Mass.:
451.698
SMILES:
CN(CC(=O)Nc1ccc(F)c(Cl)c1)S(=O)(=O)c1cc(Br)cnc1N
: