Target
Lysine-specific histone demethylase 1A
Ligand
BDBM283251
Substrate
Meas. Tech.
In Vitro Enzyme Inhibition LSD-1 Assay
Temperature
298.15±n/a K
IC50
<100±n/a nM
Comments
extracted
Citation
 Chen, YKKanouni, TKaldor, SWStafford, JAVeal, JM Inhibitors of lysine specific demethylase-1 US Patent  US10023543 Publication Date 7/17/2018 
Target
Name:
Lysine-specific histone demethylase 1A
Synonyms:
AOF2 Flavin-containing amine oxidase domain-containing protein 2 KDM1A KIAA0601 Lysine-specific demethylase 1 (LSD1) Lysine-specific histone demethylase 1 (LSD1)
Type:
Enzyme
Mol. Mass.:
92901.01
Organism:
Homo sapiens (Human)
Description:
O60341
Residue:
852
  
Inhibitor
Name:
BDBM283251
Synonyms:
4-{2-(4-amino-piperidin-1-yl)-1- methyl-6-oxo-5-[1-(2,2,2- trifluoro-ethyl)-1H-pyrazol-4-yl]- 1,6-dihydro-pyrimidin-4-yl}- benzonitrile US10207999, Example 36 US10548896, Example 36 US10960005, Example 36 US9573930, Example 36 US9776974, Example 36
Type:
Small organic molecule
Emp. Form.:
C22H22F3N7O
Mol. Mass.:
457.4516
SMILES:
Cn1c(nc(-c2ccc(cc2)C#N)c(-c2cnn(CC(F)(F)F)c2)c1=O)N1CCC(N)CC1
: