Target
Plasma kallikrein
Ligand
BDBM283481
Substrate
Meas. Tech.
In Vitro Enzyme Inhibition of hPK
pH
7.5±n/a
IC50
<100±n/a nM
Comments
extracted
Citation
 McDonald, AQian, S Therapeutic inhibitory compounds US Patent  US10023557 Publication Date 7/17/2018 
Target
Name:
Plasma kallikrein
Synonyms:
Fletcher factor KLKB1 Kallikrein Plasma kallikrein heavy chain Plasma prekallikrein
Type:
Protein
Mol. Mass.:
71391.16
Organism:
Homo sapiens (Human)
Description:
P03952
Residue:
638
  
Inhibitor
Name:
BDBM283481
Synonyms:
N-((3-chloro-6-fluoro-1H-indol-5-yl)methyl)-2- ((3-methylisoquinolin-6- yl)methyl)isonicotinamide US10266515, Example 133 US11021463, Example 133 | US9611252, Example 133
Type:
Small organic molecule
Emp. Form.:
C26H20ClFN4O
Mol. Mass.:
458.915
SMILES:
Cc1cc2cc(Cc3cc(ccn3)C(=O)NCc3cc4c(Cl)c[nH]c4cc3F)ccc2cn1
: