Target
Tyrosine-protein phosphatase non-receptor type 11
Ligand
BDBM124249
Substrate
Meas. Tech.
pNPP assay
IC50
1.974e+4± 3.05e+3 nM
Citation
 Wang, WLHuang, CGao, LXTang, CLWang, JQWu, MCSheng, LChen, HJNan, FJLi, JYLi, JFeng, B Synthesis and biological evaluation of novel bis-aromatic amides as novel PTP1B inhibitors. Bioorg Med Chem Lett 24:1889-94 (2014)  
Target
Name:
Tyrosine-protein phosphatase non-receptor type 11
Synonyms:
3.1.3.48 PTP-1D PTP2C Protein Tyrosine Phosphatase PPN11/Shp2 Protein-Tyrosine Phosphatase SHP-2 Protein-tyrosine phosphatase 2C SH-PTP3 SHP2 Src homology phosphatase 2 (SHP-2) Tyrosine-protein phosphatase non-receptor type 11 (SHP-2) | Tyrosine-protein phosphatase non-receptor type 11 (SHP2)
Type:
Protein phosphatase
Mol. Mass.:
68443.59
Organism:
Homo sapiens (Human)
Description:
Q06124
Residue:
593
  
Inhibitor
Name:
BDBM124249
Synonyms:
4-fluoro-N-(6-(4-(4-fluorobenzamido)phenyl)pyridin-3-yl)benzamide (29)
Type:
Small organic molecule
Emp. Form.:
C25H17F2N3O2
Mol. Mass.:
429.4182
SMILES:
Fc1ccc(cc1)C(=O)Nc1ccc(cc1)-c1ccc(NC(=O)c2ccc(F)cc2)cn1
: