Target
Neuraminidase
Ligand
BDBM4724
Substrate
BDBM4702
Meas. Tech.
Neuraminidase Inhibition Assay
pH
6.5±n/a
Temperature
310.15±n/a K
IC50
3000±n/a nM
Citation
 Chand, PKotian, PLMorris, PEBantia, SWalsh, DABabu, YS Synthesis and inhibitory activity of benzoic acid and pyridine derivatives on influenza neuraminidase. Bioorg Med Chem 13:2665-78 (2005)  
Target
Name:
Neuraminidase
Synonyms:
Influenza A Virus Neuraminidase NRAM_I75A5 | Neuraminidase A
Type:
Enzyme
Mol. Mass.:
52468.81
Organism:
Influenza A virus (N9)
Description:
P03472
Residue:
470
  
Inhibitor
Name:
BDBM4724
Synonyms:
3,5-dicarbamimidamido-4-(pentan-3-yloxy)benzoic acid | Benzoic Acid deriv. 6c
Type:
Small organic molecule
Emp. Form.:
C14H22N6O3
Mol. Mass.:
322.3629
SMILES:
[#6]-[#6]-[#6](-[#6]-[#6])-[#8]-c1c(cc(cc1\[#7]=[#6](/[#7])-[#7])-[#6](-[#8])=O)\[#7]=[#6](/[#7])-[#7]
:
Substrate
Name:
BDBM4702
Synonyms:
(2R,4S,5R,6R)-5-acetamido-4-hydroxy-2-[(4-methyl-2-oxo-2H-chromen-7-yl)oxy]-6-[(1R,2R)-1,2,3-trihydroxypropyl]oxane-2-carboxylic acid neuraminidase substrate
Type:
Small organic molecule
Emp. Form.:
C21H25NO11
Mol. Mass.:
467.4233
SMILES:
CC(=O)N[C@@H]1[C@@H](O)C[C@](Oc2ccc3c(C)cc(=O)oc3c2)(O[C@H]1[C@H](O)[C@H](O)CO)C(O)=O
: