Target
Dihydrofolate reductase
Ligand
BDBM50448745
Substrate
Meas. Tech.
Inhibition Assay
Ki
0.03±n/a nM
Citation
 Chen, ZCreighton, CJCunningham, MFinn, JHilgers, MJung, MKohnen, LALam, TLi, XStidham, MTari, LTrzoss, MZhang, J Dihydrofolate reductase inhibitors US Patent  US8835445 Publication Date 9/16/2014 
Target
Name:
Dihydrofolate reductase
Synonyms:
DYR_STAAU Dihydrofolate reductase Tetrahydrofolate dehydrogenase | folA
Type:
Enzyme
Mol. Mass.:
18249.71
Organism:
Staphylococcus aureus
Description:
Residue:
159
  
Inhibitor
Name:
BDBM50448745
Synonyms:
CHEMBL3128013 | US8835445, 26
Type:
Small organic molecule
Emp. Form.:
C21H19N7S
Mol. Mass.:
401.487
SMILES:
Cc1cc2nc(-c3nccs3)n(-c3cc4nc(N)nc(N)c4cc3C)c2cc1C
: