Target
Dihydrofolate reductase
Ligand
BDBM50351175
Substrate
Meas. Tech.
Inhibition Assay
Ki
0.02±n/a nM
Citation
 Chen, ZCreighton, CJCunningham, MFinn, JHilgers, MJung, MKohnen, LALam, TLi, XStidham, MTari, LTrzoss, MZhang, J Dihydrofolate reductase inhibitors US Patent  US8835445 Publication Date 9/16/2014 
Target
Name:
Dihydrofolate reductase
Synonyms:
DYR_STAAU Dihydrofolate reductase Tetrahydrofolate dehydrogenase | folA
Type:
Enzyme
Mol. Mass.:
18249.71
Organism:
Staphylococcus aureus
Description:
Residue:
159
  
Inhibitor
Name:
BDBM50351175
Synonyms:
CHEMBL1818127 | US8835445, 30
Type:
Small organic molecule
Emp. Form.:
C23H23N5O3S
Mol. Mass.:
449.525
SMILES:
CCOc1ccc(cc1-c1ccc2c(N)nc(N)nc2c1)-c1cccc(NS(C)(=O)=O)c1
: