Target
Dihydrofolate reductase
Ligand
BDBM131853
Substrate
Meas. Tech.
Inhibition Assay
Ki
0.005±n/a nM
Citation
 Chen, ZCreighton, CJCunningham, MFinn, JHilgers, MJung, MKohnen, LALam, TLi, XStidham, MTari, LTrzoss, MZhang, J Dihydrofolate reductase inhibitors US Patent  US8835445 Publication Date 9/16/2014 
Target
Name:
Dihydrofolate reductase
Synonyms:
DYR_STAAU Dihydrofolate reductase Tetrahydrofolate dehydrogenase | folA
Type:
Enzyme
Mol. Mass.:
18249.71
Organism:
Staphylococcus aureus
Description:
Residue:
159
  
Inhibitor
Name:
BDBM131853
Synonyms:
US8835445, 36
Type:
Small organic molecule
Emp. Form.:
C20H16N6S
Mol. Mass.:
372.446
SMILES:
Cc1ccc2n(c(nc2c1)-c1cccs1)-c1ccc2c(N)nc(N)nc2c1
: