Target
Macrophage colony-stimulating factor 1 receptor
Ligand
BDBM132047
Substrate
Meas. Tech.
LANCE Ultra TR-FRET Assay
pH
7.3±n/a
Temperature
295.15±n/a K
IC50
1563.4±n/a nM
Citation
 Boys, MLBradley, MFDeLisle, RKHennings, DDKennedy, ALMarmsater, FPMedina, MDMunson, MCRast, BRizzi, JPRodriguez, METopalov, GTZhao, Q Substituted N-(1H-indazol-4-yl)imidazo[1,2-a]pyridine-3-carboxamide compounds as cFMS inhibitors US Patent  US8841455 Publication Date 9/23/2014 
Target
Name:
Macrophage colony-stimulating factor 1 receptor
Synonyms:
CSF1R FMS Macrophage colony stimulating factor receptor Macrophage colony-stimulating factor 1 receptor (c-FMS) Proto-oncogene c-Fms c-fms | cFMS
Type:
Protein
Mol. Mass.:
107979.48
Organism:
Homo sapiens (Human)
Description:
P07333
Residue:
972
  
Inhibitor
Name:
BDBM132047
Synonyms:
US8841455, 142
Type:
Small organic molecule
Emp. Form.:
C21H18N6OS
Mol. Mass.:
402.472
SMILES:
CCc1nn(Cc2nccs2)c2cccc(NC(=O)c3cnc4ccccn34)c12
: