Target
Cannabinoid receptor 2
Ligand
BDBM9651
Substrate
Meas. Tech.
Radioligand Binding Assay
pH
7.4±n/a
Temperature
303.15±n/a K
Ki
0.6±n/a nM
Comments
extracted
Citation
 Carroll, WADart, MJFrost, JMKolasa, TLi, TLiu, BPerez-Medrano, APatel, MWang, XPeddi, S Compounds as cannabinoid receptor ligands US Patent  US8846730 Publication Date 9/30/2014 
Target
Name:
Cannabinoid receptor 2
Synonyms:
CANNABINOID CB2 CB2 Cannabinoid CB2 receptor Cnr2 | rCB2
Type:
Enzyme
Mol. Mass.:
39366.68
Organism:
Rattus norvegicus (Rat)
Description:
Q9QZN9
Residue:
360
  
Inhibitor
Name:
BDBM9651
Synonyms:
US8846730, 4
Type:
Emp. Form.:
C26H34F3N3O3S
Mol. Mass.:
525.627
SMILES:
CC(C)(C)c1cn(C[C@H]2CCCO2)\c(=N\C(=O)c2cc(ccc2OC[C@@H]2CCCCN2)C(F)(F)F)s1
: