Target
Cannabinoid receptor 2
Ligand
BDBM135857
Substrate
Meas. Tech.
Radioligand Binding Assay
pH
7.4±n/a
Ki
0.8±n/a nM
Comments
extracted
Citation
 Carroll, WADart, MJFrost, JMLatshaw, SPKolasa, TLi, TPeddi, SLiu, BPerez-Medrano, APatel, MWang, XNelson, DW Compounds as cannabinoid receptor ligands US Patent  US8859596 Publication Date 10/14/2014 
Target
Name:
Cannabinoid receptor 2
Synonyms:
CANNABINOID CB2 CB2 Cannabinoid CB2 receptor Cnr2 | rCB2
Type:
Enzyme
Mol. Mass.:
39366.68
Organism:
Rattus norvegicus (Rat)
Description:
Q9QZN9
Residue:
360
  
Inhibitor
Name:
BDBM135857
Synonyms:
US8859596, 144
Type:
Small organic molecule
Emp. Form.:
C21H29F3N4O2S
Mol. Mass.:
458.541
SMILES:
CCCCn1nc(s\c1=N/C(=O)c1cc(ccc1ONC(C)C)C(F)(F)F)C(C)(C)C
: