Target
Beta-secretase 1
Ligand
BDBM150696
Substrate
Meas. Tech.
Fluorescence Quench Assay
pH
4.4±n/a
IC50
10±n/a nM
Comments
extracted
Citation
 Bukhtiyarov, YCacatian, SDillard, LWDorner-Ciossek, CFuchs, KJia, LLala, DSMorales-Ramos, AReeves, JSingh, SBVenkatraman, SXu, ZYuan, JZhao, YZheng, YRast, G Inhibitors of β-secretase US Patent  US8981112 Publication Date 3/17/2015 
Target
Name:
Beta-secretase 1
Synonyms:
ASP2 Aspartyl protease 2 BACE1 Beta-secretase (BACE) Beta-secretase 1 (BACE 1) Beta-secretase 1 (BACE1) Beta-site amyloid precursor protein cleaving enzyme 1 Memapsin-2 beta-Secretase (BACE-1) | beta-Secretase (BACE1)
Type:
Protein
Mol. Mass.:
55755.10
Organism:
Homo sapiens (Human)
Description:
P56817
Residue:
501
  
Inhibitor
Name:
BDBM150696
Synonyms:
US8981112, 3 US9949975, Example 3
Type:
Small organic molecule
Emp. Form.:
C24H31FN4O2
Mol. Mass.:
426.5269
SMILES:
CC[C@@H]1C[C@@]2(Cc3ccc(cc3[C@]22N=C(N)N(CC(C)(C)F)C2=O)C#N)CC[C@H]1OC
: