Target
Beta-secretase 1
Ligand
BDBM150700
Substrate
Meas. Tech.
Fluorescence Quench Assay
pH
4.4±n/a
IC50
2±n/a nM
Comments
extracted
Citation
 Bukhtiyarov, YCacatian, SDillard, LWDorner-Ciossek, CFuchs, KJia, LLala, DSMorales-Ramos, AReeves, JSingh, SBVenkatraman, SXu, ZYuan, JZhao, YZheng, YRast, G Inhibitors of β-secretase US Patent  US8981112 Publication Date 3/17/2015 
Target
Name:
Beta-secretase 1
Synonyms:
ASP2 Aspartyl protease 2 BACE1 Beta-secretase (BACE) Beta-secretase 1 (BACE 1) Beta-secretase 1 (BACE1) Beta-site amyloid precursor protein cleaving enzyme 1 Memapsin-2 beta-Secretase (BACE-1) | beta-Secretase (BACE1)
Type:
Protein
Mol. Mass.:
55755.10
Organism:
Homo sapiens (Human)
Description:
P56817
Residue:
501
  
Inhibitor
Name:
BDBM150700
Synonyms:
US8981112, 7 US9949975, Example 7
Type:
Small organic molecule
Emp. Form.:
C22H28N4O3
Mol. Mass.:
396.4827
SMILES:
COCCN1C(N)=N[C@@]2(C1=O)c1cc(ccc1C[C@@]21CC[C@H](OC)[C@@H](C)C1)C#N
: