Target
Beta-secretase 1
Ligand
BDBM150717
Substrate
Meas. Tech.
Fluorescence Quench Assay
pH
4.4±n/a
IC50
5±n/a nM
Comments
extracted
Citation
 Bukhtiyarov, YCacatian, SDillard, LWDorner-Ciossek, CFuchs, KJia, LLala, DSMorales-Ramos, AReeves, JSingh, SBVenkatraman, SXu, ZYuan, JZhao, YZheng, YRast, G Inhibitors of β-secretase US Patent  US8981112 Publication Date 3/17/2015 
Target
Name:
Beta-secretase 1
Synonyms:
ASP2 Aspartyl protease 2 BACE1 Beta-secretase (BACE) Beta-secretase 1 (BACE 1) Beta-secretase 1 (BACE1) Beta-site amyloid precursor protein cleaving enzyme 1 Memapsin-2 beta-Secretase (BACE-1) | beta-Secretase (BACE1)
Type:
Protein
Mol. Mass.:
55755.10
Organism:
Homo sapiens (Human)
Description:
P56817
Residue:
501
  
Inhibitor
Name:
BDBM150717
Synonyms:
US8981112, 24 US9949975, Example 24
Type:
Small organic molecule
Emp. Form.:
C25H28N6O2
Mol. Mass.:
444.5288
SMILES:
CO[C@@H]1[C@@H](C)C[C@]2(Cc3ccc(cc3[C@]22N=C(N)N(Cc3ccncn3)C2=O)C#N)C[C@H]1C
: