Target
Hepatic triacylglycerol lipase
Ligand
BDBM151441
Substrate
Meas. Tech.
Biological Assay
pH
8±n/a
Temperature
298.15±n/a K
IC50
1.4±n/a nM
Comments
extracted
Citation
 Finlay, HJiang, JKim, SParkhurst, BQiao, JXWang, TCPi, ZTora, GOLloyd, JJohnson, JA Amide, urea or sulfone amide linked benzothiazole inhibitors of endothelial lipase US Patent  US8987314 Publication Date 3/24/2015 
Target
Name:
Hepatic triacylglycerol lipase
Synonyms:
HL Hepatic Lipase (HL) Hepatic triacylglycerol lipase LIPC_HUMAN | Lipase member C
Type:
Protein
Mol. Mass.:
55938.55
Organism:
Homo sapiens (Human)
Description:
P11150
Residue:
499
  
Inhibitor
Name:
BDBM151441
Synonyms:
US8987314, B252
Type:
Small organic molecule
Emp. Form.:
C23H23N3O4S2
Mol. Mass.:
469.576
SMILES:
CC(C)c1cc(CNC(=O)C(c2nc3ccc(cc3s2)-c2ccccc2)S(C)(=O)=O)on1
: