Target
Hepatic triacylglycerol lipase
Ligand
BDBM151554
Substrate
Meas. Tech.
Biological Assay
pH
8±n/a
Temperature
298.15±n/a K
IC50
2.1±n/a nM
Comments
extracted
Citation
 Finlay, HJiang, JKim, SParkhurst, BQiao, JXWang, TCPi, ZTora, GOLloyd, JJohnson, JA Amide, urea or sulfone amide linked benzothiazole inhibitors of endothelial lipase US Patent  US8987314 Publication Date 3/24/2015 
Target
Name:
Hepatic triacylglycerol lipase
Synonyms:
HL Hepatic Lipase (HL) Hepatic triacylglycerol lipase LIPC_HUMAN | Lipase member C
Type:
Protein
Mol. Mass.:
55938.55
Organism:
Homo sapiens (Human)
Description:
P11150
Residue:
499
  
Inhibitor
Name:
BDBM151554
Synonyms:
US8987314, B365
Type:
Small organic molecule
Emp. Form.:
C25H21F4N3O6S3
Mol. Mass.:
631.639
SMILES:
NS(=O)(=O)CCNC(=O)C(c1nc2ccc(cc2s1)-c1ccccc1F)S(=O)(=O)Cc1ccc(OC(F)(F)F)cc1
: