Target
Neuraminidase
Ligand
BDBM5015
Substrate
BDBM4702
Meas. Tech.
Neuraminidase Inhibition Assay
IC50
90±n/a nM
Citation
 Kim, CULew, WWilliams, MAWu, HZhang, LChen, XEscarpe, PAMendel, DBLaver, WGStevens, RC Structure-activity relationship studies of novel carbocyclic influenza neuraminidase inhibitors. J Med Chem 41:2451-60 (1998)  
Target
Name:
Neuraminidase
Synonyms:
Influenza B Virus Neuraminidase NRAM_INBLE Neuraminidase B
Type:
Enzyme
Mol. Mass.:
51446.67
Organism:
Influenza B virus (B/Lee/40)
Description:
Residue:
466
  
Inhibitor
Name:
BDBM5015
Synonyms:
(3S,4R,5S)-5-amino-4-acetamido-2-fluoro-3-(pentan-3-yloxy)cyclohex-1-ene-1-carboxylic acid | Carbocyclic Analogue 30
Type:
Small organic molecule
Emp. Form.:
C14H23FN2O4
Mol. Mass.:
302.3418
SMILES:
CCC(CC)O[C@H]1[C@H](NC(C)=O)[C@@H](N)CC(C(O)=O)=C1F
:
Substrate
Name:
BDBM4702
Synonyms:
(2R,4S,5R,6R)-5-acetamido-4-hydroxy-2-[(4-methyl-2-oxo-2H-chromen-7-yl)oxy]-6-[(1R,2R)-1,2,3-trihydroxypropyl]oxane-2-carboxylic acid neuraminidase substrate
Type:
Small organic molecule
Emp. Form.:
C21H25NO11
Mol. Mass.:
467.4233
SMILES:
CC(=O)N[C@@H]1[C@@H](O)C[C@](Oc2ccc3c(C)cc(=O)oc3c2)(O[C@H]1[C@H](O)[C@H](O)CO)C(O)=O
: