Target
Prostaglandin G/H synthase 1
Ligand
BDBM152804
Substrate
Meas. Tech.
In vitro Cyclooxygenase Inhibition Assay
pH
8±n/a
Temperature
298.15±n/a K
IC50
1.2e+2±n/a nM
Comments
extracted
Citation
 Irannejad, HUnsal Tan, OOzadali, KDadashpour, STuylu Kucukkilinc, TAhangar, NAhmadnejad, MEmami, S 1,2-Diaryl-2-hydroxyiminoethanones as dual COX-1 and ß-amyloid aggregation inhibitors: biological evaluation and in silico study. Chem Biol Drug Des 85:494-503 (2015)  
Target
Name:
Prostaglandin G/H synthase 1
Synonyms:
COX1 Cyclooxygenase-1 (COX-1) PTGS1 | Prostaglandin G/H synthase (cyclooxygenase)
Type:
Protein
Mol. Mass.:
68868.60
Organism:
Ovis aries (Sheep)
Description:
Residue:
600
  
Inhibitor
Name:
BDBM152804
Synonyms:
(2E)-2-(N-hydroxyimino)-1-(4-methanesulfonylphenyl)-2-(4-methoxyphenyl)ethan-1-one (3)
Type:
Small organic molecule
Emp. Form.:
C16H15NO5S
Mol. Mass.:
333.359
SMILES:
COc1ccc(cc1)C(=N/O)\C(=O)c1ccc(cc1)S(C)(=O)=O
: