Target
Aurora kinase B/Inner centromere protein
Ligand
BDBM47224
Substrate
Meas. Tech.
HTRF Assay
IC50
1±n/a nM
Citation
 Carry, JCheve, MClerc, FCombeau, CGontier, SKrick, ALachaud, SSchio, L Anti-cancer compound and pharmaceutical composition containing the same US Patent  US9073917 Publication Date 7/7/2015 
Target
Name:
Aurora kinase B/Inner centromere protein
Synonyms:
Aurora B/Incenp
Type:
Protein Complex
Mol. Mass.:
Description:
Components:
This complex has 2 components.
Component 1
Name:
Aurora kinase B
Synonyms:
AIK2 AIM1 ARK2 AURKB_HUMAN Aurora B-INCENP Aurora kinase B (AURKB) STK-1 STK12 Serine/threonine-protein kinase aurora B
Type:
Protein
Mol. Mass.:
39327.72
Organism:
Homo sapiens (Human)
Description:
Q96GD4
Residue:
344
  
Component 2
Name:
Inner centromere protein
Synonyms:
INCENP | INCE_HUMAN
Type:
Protein
Mol. Mass.:
105461.33
Organism:
Homo sapiens (Human)
Description:
Q9NQS7
Residue:
918
  
Inhibitor
Name:
BDBM47224
Synonyms:
US9073917, 2-inventive
Type:
Emp. Form.:
C26H24N4O2
Mol. Mass.:
424.4944
SMILES:
CCc1[nH]cc2[C@@H](C3=C(CCCC3=O)Nc12)c1cccc(Oc2nc3ccccc3[nH]2)c1
: