Target
Aurora kinase B/Inner centromere protein
Ligand
BDBM167509
Substrate
Meas. Tech.
Radioactive Assay
IC50
13±n/a nM
Citation
 Carry, JCheve, MClerc, FCombeau, CGontier, SKrick, ALachaud, SSchio, L Anti-cancer compound and pharmaceutical composition containing the same US Patent  US9073917 Publication Date 7/7/2015 
Target
Name:
Aurora kinase B/Inner centromere protein
Synonyms:
Aurora B/Incenp
Type:
Protein Complex
Mol. Mass.:
Description:
Components:
This complex has 2 components.
Component 1
Name:
Aurora kinase B
Synonyms:
AIK2 AIM1 ARK2 AURKB_HUMAN Aurora B-INCENP Aurora kinase B (AURKB) STK-1 STK12 Serine/threonine-protein kinase aurora B
Type:
Protein
Mol. Mass.:
39327.72
Organism:
Homo sapiens (Human)
Description:
Q96GD4
Residue:
344
  
Component 2
Name:
Inner centromere protein
Synonyms:
INCENP | INCE_HUMAN
Type:
Protein
Mol. Mass.:
105461.33
Organism:
Homo sapiens (Human)
Description:
Q9NQS7
Residue:
918
  
Inhibitor
Name:
BDBM167509
Synonyms:
US9073917, 6- comparative
Type:
Small organic molecule
Emp. Form.:
C22H18N6O2
Mol. Mass.:
398.4173
SMILES:
O=C1CNCC2=C1C(c1c[nH]nc1N2)c1cccc(Oc2nc3ccccc3[nH]2)c1
: