Target
Cyclin-dependent kinase 9
Ligand
BDBM167544
Substrate
Meas. Tech.
LANCE ULight TR-FRET Kinase Assay
IC50
17±n/a nM
Citation
 Gong, JTao, ZPenning, TDSouers, AJTong, YZhu, G Pyrrolo[2,3-B]pyridine CDK9 kinase inhibitors US Patent  US9073922 Publication Date 7/7/2015 
Target
Name:
Cyclin-dependent kinase 9
Synonyms:
C-2K CDK9 Cell division cycle 2-like protein kinase 4 Cyclin-Dependent Kinase 9 (CDK9) Serine/threonine-protein kinase PITALRE Tat-associated kinase complex catalytic subunit
Type:
Enzyme Subunit
Mol. Mass.:
42789.13
Organism:
Homo sapiens (Human)
Description:
Residue:
372
  
Inhibitor
Name:
BDBM167544
Synonyms:
US9073922, 28 | US9796708, Example 28
Type:
Small organic molecule
Emp. Form.:
C20H22FN3O
Mol. Mass.:
339.4066
SMILES:
COc1ccc(F)cc1-c1ccnc2[nH]c(cc12)C1CCN(C)CC1
: