Target
Cyclin-dependent kinase 9
Ligand
BDBM167669
Substrate
Meas. Tech.
LANCE ULight TR-FRET Kinase Assay
IC50
15±n/a nM
Citation
 Gong, JTao, ZPenning, TDSouers, AJTong, YZhu, G Pyrrolo[2,3-B]pyridine CDK9 kinase inhibitors US Patent  US9073922 Publication Date 7/7/2015 
Target
Name:
Cyclin-dependent kinase 9
Synonyms:
C-2K CDK9 Cell division cycle 2-like protein kinase 4 Cyclin-Dependent Kinase 9 (CDK9) Serine/threonine-protein kinase PITALRE Tat-associated kinase complex catalytic subunit
Type:
Enzyme Subunit
Mol. Mass.:
42789.13
Organism:
Homo sapiens (Human)
Description:
Residue:
372
  
Inhibitor
Name:
BDBM167669
Synonyms:
US9073922, 156 | US9796708, Example 156
Type:
Small organic molecule
Emp. Form.:
C22H25N7
Mol. Mass.:
387.4808
SMILES:
CN1CCC(CC1)c1cc2c(ccnc2[nH]1)-c1cccc(NCc2cc[nH]n2)n1
: