Target
Cyclin-dependent kinase 9
Ligand
BDBM167703
Substrate
Meas. Tech.
LANCE ULight TR-FRET Kinase Assay
IC50
8±n/a nM
Citation
 Gong, JTao, ZPenning, TDSouers, AJTong, YZhu, G Pyrrolo[2,3-B]pyridine CDK9 kinase inhibitors US Patent  US9073922 Publication Date 7/7/2015 
Target
Name:
Cyclin-dependent kinase 9
Synonyms:
C-2K CDK9 Cell division cycle 2-like protein kinase 4 Cyclin-Dependent Kinase 9 (CDK9) Serine/threonine-protein kinase PITALRE Tat-associated kinase complex catalytic subunit
Type:
Enzyme Subunit
Mol. Mass.:
42789.13
Organism:
Homo sapiens (Human)
Description:
Residue:
372
  
Inhibitor
Name:
BDBM167703
Synonyms:
US9073922, 190 | US9796708, Example 190
Type:
Small organic molecule
Emp. Form.:
C27H29FN4O2S
Mol. Mass.:
492.608
SMILES:
CN1CCC(CC1)c1cc2c(ccnc2[nH]1)-c1cc(NCc2ccc(cc2)S(C)(=O)=O)ccc1F
: