Target
Cyclin-dependent kinase 9
Ligand
BDBM167812
Substrate
Meas. Tech.
LANCE ULight TR-FRET Kinase Assay
IC50
9±n/a nM
Citation
 Gong, JTao, ZPenning, TDSouers, AJTong, YZhu, G Pyrrolo[2,3-B]pyridine CDK9 kinase inhibitors US Patent  US9073922 Publication Date 7/7/2015 
Target
Name:
Cyclin-dependent kinase 9
Synonyms:
C-2K CDK9 Cell division cycle 2-like protein kinase 4 Cyclin-Dependent Kinase 9 (CDK9) Serine/threonine-protein kinase PITALRE Tat-associated kinase complex catalytic subunit
Type:
Enzyme Subunit
Mol. Mass.:
42789.13
Organism:
Homo sapiens (Human)
Description:
Residue:
372
  
Inhibitor
Name:
BDBM167812
Synonyms:
US9073922, 308
Type:
Small organic molecule
Emp. Form.:
C25H26FN5
Mol. Mass.:
415.5058
SMILES:
NC1CCCC(C1)c1cc2c(ccnc2[nH]1)-c1cccc(NCc2cccc(F)c2)n1
: