Target
Cyclin-dependent kinase 9
Ligand
BDBM167822
Substrate
Meas. Tech.
LANCE ULight TR-FRET Kinase Assay
IC50
10±n/a nM
Citation
 Gong, JTao, ZPenning, TDSouers, AJTong, YZhu, G Pyrrolo[2,3-B]pyridine CDK9 kinase inhibitors US Patent  US9073922 Publication Date 7/7/2015 
Target
Name:
Cyclin-dependent kinase 9
Synonyms:
C-2K CDK9 Cell division cycle 2-like protein kinase 4 Cyclin-Dependent Kinase 9 (CDK9) Serine/threonine-protein kinase PITALRE Tat-associated kinase complex catalytic subunit
Type:
Enzyme Subunit
Mol. Mass.:
42789.13
Organism:
Homo sapiens (Human)
Description:
Residue:
372
  
Inhibitor
Name:
BDBM167822
Synonyms:
US9073922, 318
Type:
Small organic molecule
Emp. Form.:
C23H23FN6
Mol. Mass.:
402.4673
SMILES:
Fc1cccc(CNc2cncc(n2)-c2ccnc3[nH]c(cc23)C2CCNCC2)c1
: