Target
Cyclin-dependent kinase 9
Ligand
BDBM167841
Substrate
Meas. Tech.
LANCE ULight TR-FRET Kinase Assay
IC50
11±n/a nM
Citation
 Gong, JTao, ZPenning, TDSouers, AJTong, YZhu, G Pyrrolo[2,3-B]pyridine CDK9 kinase inhibitors US Patent  US9073922 Publication Date 7/7/2015 
Target
Name:
Cyclin-dependent kinase 9
Synonyms:
C-2K CDK9 Cell division cycle 2-like protein kinase 4 Cyclin-Dependent Kinase 9 (CDK9) Serine/threonine-protein kinase PITALRE Tat-associated kinase complex catalytic subunit
Type:
Enzyme Subunit
Mol. Mass.:
42789.13
Organism:
Homo sapiens (Human)
Description:
Residue:
372
  
Inhibitor
Name:
BDBM167841
Synonyms:
US9073922, 337
Type:
Small organic molecule
Emp. Form.:
C26H28FN5O3
Mol. Mass.:
477.5306
SMILES:
OCC(O)CN1CCC(CC1)c1cc2c(ccnc2[nH]1)-c1cncc(OCc2cccc(F)c2)n1
: