Target
Cyclin-dependent kinase 9
Ligand
BDBM167842
Substrate
Meas. Tech.
LANCE ULight TR-FRET Kinase Assay
IC50
14±n/a nM
Citation
 Gong, JTao, ZPenning, TDSouers, AJTong, YZhu, G Pyrrolo[2,3-B]pyridine CDK9 kinase inhibitors US Patent  US9073922 Publication Date 7/7/2015 
Target
Name:
Cyclin-dependent kinase 9
Synonyms:
C-2K CDK9 Cell division cycle 2-like protein kinase 4 Cyclin-Dependent Kinase 9 (CDK9) Serine/threonine-protein kinase PITALRE Tat-associated kinase complex catalytic subunit
Type:
Enzyme Subunit
Mol. Mass.:
42789.13
Organism:
Homo sapiens (Human)
Description:
Residue:
372
  
Inhibitor
Name:
BDBM167842
Synonyms:
US9073922, 338
Type:
Small organic molecule
Emp. Form.:
C26H28FN7O4S
Mol. Mass.:
553.608
SMILES:
CCOC(=O)NS(=O)(=O)N1CCC(CC1)c1cc2c(ccnc2[nH]1)-c1cncc(NCc2cccc(F)c2)n1
: