Target
Cyclin-dependent kinase 9
Ligand
BDBM167858
Substrate
Meas. Tech.
LANCE ULight TR-FRET Kinase Assay
IC50
2±n/a nM
Citation
 Gong, JTao, ZPenning, TDSouers, AJTong, YZhu, G Pyrrolo[2,3-B]pyridine CDK9 kinase inhibitors US Patent  US9073922 Publication Date 7/7/2015 
Target
Name:
Cyclin-dependent kinase 9
Synonyms:
C-2K CDK9 Cell division cycle 2-like protein kinase 4 Cyclin-Dependent Kinase 9 (CDK9) Serine/threonine-protein kinase PITALRE Tat-associated kinase complex catalytic subunit
Type:
Enzyme Subunit
Mol. Mass.:
42789.13
Organism:
Homo sapiens (Human)
Description:
Residue:
372
  
Inhibitor
Name:
BDBM167858
Synonyms:
US9073922, 355
Type:
Small organic molecule
Emp. Form.:
C24H22F3N5
Mol. Mass.:
437.4602
SMILES:
Fc1cccc(CNc2nc(c(F)cc2F)-c2ccnc3[nH]c(cc23)C2CCNCC2)c1
: