Target
Histone-lysine N-methyltransferase EZH2 [Y641F]
Ligand
BDBM172063
Substrate
Meas. Tech.
Enzyme Assay
Temperature
298.15±n/a K
IC50
2.6±n/a nM
Comments
extracted
Citation
 Kuntz, KWChesworth, RDuncan, KWKeilhack, HWarholic, NKlaus, CKnutson, SKWigle, TJSeki, MShirotori, SKawano, S Aryl- or heteroaryl-substituted benzene compounds US Patent  US9090562 Publication Date 7/28/2015 
Target
Name:
Histone-lysine N-methyltransferase EZH2 [Y641F]
Synonyms:
EZH2 EZH2_HUMAN KMT6
Type:
Mol. Mass.:
85351.84
Organism:
Homo sapiens (Human)
Description:
Q15910[Y641F]
Residue:
746
  
Inhibitor
Name:
BDBM172063
Synonyms:
US10155002, Compound 69 US9090562, 69
Type:
Small organic molecule
Emp. Form.:
C34H44N4O3
Mol. Mass.:
556.7382
SMILES:
CCN(C1CCOCC1)c1cc(cc(C(=O)NCc2c(C)cc(C)[nH]c2=O)c1C)-c1ccc(CN2CCCC2)cc1
: