Target
Histone-lysine N-methyltransferase EZH2 [Y641F]
Ligand
BDBM172162
Substrate
Meas. Tech.
Enzyme Assay
Temperature
298.15±n/a K
IC50
1.63±n/a nM
Comments
extracted
Citation
 Kuntz, KWChesworth, RDuncan, KWKeilhack, HWarholic, NKlaus, CKnutson, SKWigle, TJSeki, MShirotori, SKawano, S Aryl- or heteroaryl-substituted benzene compounds US Patent  US9090562 Publication Date 7/28/2015 
Target
Name:
Histone-lysine N-methyltransferase EZH2 [Y641F]
Synonyms:
EZH2 EZH2_HUMAN KMT6
Type:
Mol. Mass.:
85351.84
Organism:
Homo sapiens (Human)
Description:
Q15910[Y641F]
Residue:
746
  
Inhibitor
Name:
BDBM172162
Synonyms:
US10155002, Compound 170 US9090562, 170
Type:
Small organic molecule
Emp. Form.:
C36H51N7O2
Mol. Mass.:
613.8358
SMILES:
CCN([C@H]1CC[C@@H](CC1)N(C)C)c1cc(cc(C(=O)NCc2c(C)cc(C)[nH]c2=O)c1C)-c1ccc(nc1)N1CCN(C)CC1
: