Target
Histone-lysine N-methyltransferase EZH2 [Y641F]
Ligand
BDBM172163
Substrate
Meas. Tech.
Enzyme Assay
Temperature
298.15±n/a K
IC50
0.76±n/a nM
Comments
extracted
Citation
 Kuntz, KWChesworth, RDuncan, KWKeilhack, HWarholic, NKlaus, CKnutson, SKWigle, TJSeki, MShirotori, SKawano, S Aryl- or heteroaryl-substituted benzene compounds US Patent  US9090562 Publication Date 7/28/2015 
Target
Name:
Histone-lysine N-methyltransferase EZH2 [Y641F]
Synonyms:
EZH2 EZH2_HUMAN KMT6
Type:
Mol. Mass.:
85351.84
Organism:
Homo sapiens (Human)
Description:
Q15910[Y641F]
Residue:
746
  
Inhibitor
Name:
BDBM172163
Synonyms:
US10155002, Compound 171 US9090562, 171
Type:
Small organic molecule
Emp. Form.:
C33H44N6O3
Mol. Mass.:
572.7409
SMILES:
CCN(C1CCOCC1)c1cc(cc(C(=O)NCc2c(C)cc(C)[nH]c2=O)c1C)-c1ccc(nc1)N1CCN(C)CC1
: