Target
Neuraminidase
Ligand
BDBM5263
Substrate
BDBM4702
Meas. Tech.
Neuraminidase Inhibition Assay
IC50
14±n/a nM
Citation
 Lew, WWu, HChen, XGraves, BJEscarpe, PAMacArthur, HLMendel, DBKim, CU Carbocyclic influenza neuraminidase inhibitors possessing a C3-cyclic amine side chain: synthesis and inhibitory activity. Bioorg Med Chem Lett 10:1257-60 (2000)  
Target
Name:
Neuraminidase
Synonyms:
Influenza B Virus Neuraminidase NRAM_INBLE Neuraminidase B
Type:
Enzyme
Mol. Mass.:
51446.67
Organism:
Influenza B virus (B/Lee/40)
Description:
Residue:
466
  
Inhibitor
Name:
BDBM5263
Synonyms:
(3R,4R,5S)-5-amino-4-acetamido-3-[(2R)-2-(hydroxymethyl)azepan-1-yl]cyclohex-1-ene-1-carboxylic acid | C3-Cyclic Amine Carbocyclic Analogue 4n
Type:
Small organic molecule
Emp. Form.:
C16H27N3O4
Mol. Mass.:
325.4033
SMILES:
CC(=O)N[C@@H]1[C@@H](N)CC(=C[C@H]1N1CCCCC[C@@H]1CO)C(O)=O
:
Substrate
Name:
BDBM4702
Synonyms:
(2R,4S,5R,6R)-5-acetamido-4-hydroxy-2-[(4-methyl-2-oxo-2H-chromen-7-yl)oxy]-6-[(1R,2R)-1,2,3-trihydroxypropyl]oxane-2-carboxylic acid neuraminidase substrate
Type:
Small organic molecule
Emp. Form.:
C21H25NO11
Mol. Mass.:
467.4233
SMILES:
CC(=O)N[C@@H]1[C@@H](O)C[C@](Oc2ccc3c(C)cc(=O)oc3c2)(O[C@H]1[C@H](O)[C@H](O)CO)C(O)=O
: