Target
Androgen receptor
Ligand
BDBM180872
Substrate
Meas. Tech.
Biological Assay
IC50
14±n/a nM
Citation
 Miller, CP Selective androgen receptor modulators US Patent  US9133182 Publication Date 9/15/2015 
Target
Name:
Androgen receptor
Synonyms:
ANDR_RAT Ar Nr3c4 | androgen
Type:
Enzyme
Mol. Mass.:
98219.08
Organism:
Rattus norvegicus (Rat)
Description:
P15207
Residue:
902
  
Inhibitor
Name:
BDBM180872
Synonyms:
US9133182, Example 1
Type:
Small organic molecule
Emp. Form.:
C14H10F6N2O2
Mol. Mass.:
352.2318
SMILES:
O[C@@H]([C@H]1CCC(=O)N1c1ccc(C#N)c(c1)C(F)(F)F)C(F)(F)F
: