Target
Androgen receptor
Ligand
BDBM180875
Substrate
Meas. Tech.
Biological Assay
IC50
120±n/a nM
Citation
 Miller, CP Selective androgen receptor modulators US Patent  US9133182 Publication Date 9/15/2015 
Target
Name:
Androgen receptor
Synonyms:
ANDR_RAT Ar Nr3c4 | androgen
Type:
Enzyme
Mol. Mass.:
98219.08
Organism:
Rattus norvegicus (Rat)
Description:
P15207
Residue:
902
  
Inhibitor
Name:
BDBM180875
Synonyms:
US9133182, Example 4
Type:
Small organic molecule
Emp. Form.:
C15H12F6N2O2
Mol. Mass.:
366.2584
SMILES:
Cc1c(ccc(C#N)c1C(F)(F)F)N1[C@H](CCC1=O)[C@@H](O)C(F)(F)F
: