Target
Androgen receptor
Ligand
BDBM180878
Substrate
Meas. Tech.
Biological Assay
IC50
50±n/a nM
Citation
 Miller, CP Selective androgen receptor modulators US Patent  US9133182 Publication Date 9/15/2015 
Target
Name:
Androgen receptor
Synonyms:
ANDR_RAT Ar Nr3c4 | androgen
Type:
Enzyme
Mol. Mass.:
98219.08
Organism:
Rattus norvegicus (Rat)
Description:
P15207
Residue:
902
  
Inhibitor
Name:
BDBM180878
Synonyms:
US9133182, Example 7
Type:
Small organic molecule
Emp. Form.:
C13H8F6N2O3
Mol. Mass.:
354.2046
SMILES:
O[C@@H]([C@H]1COC(=O)N1c1ccc(C#N)c(c1)C(F)(F)F)C(F)(F)F
: