Target
Androgen receptor
Ligand
BDBM180881
Substrate
Meas. Tech.
Biological Assay
IC50
>1000±n/a nM
Citation
 Miller, CP Selective androgen receptor modulators US Patent  US9133182 Publication Date 9/15/2015 
Target
Name:
Androgen receptor
Synonyms:
ANDR_RAT Ar Nr3c4 | androgen
Type:
Enzyme
Mol. Mass.:
98219.08
Organism:
Rattus norvegicus (Rat)
Description:
P15207
Residue:
902
  
Inhibitor
Name:
BDBM180881
Synonyms:
US9133182, Example 10
Type:
Small organic molecule
Emp. Form.:
C12H8ClF3N2O3
Mol. Mass.:
320.652
SMILES:
O[C@H]([C@@H]1COC(=O)N1c1ccc(C#N)c(Cl)c1)C(F)(F)F
: