Target
Androgen receptor
Ligand
BDBM180896
Substrate
Meas. Tech.
Biological Assay
IC50
10±n/a nM
Citation
 Miller, CP Selective androgen receptor modulators US Patent  US9133182 Publication Date 9/15/2015 
Target
Name:
Androgen receptor
Synonyms:
ANDR_RAT Ar Nr3c4 | androgen
Type:
Enzyme
Mol. Mass.:
98219.08
Organism:
Rattus norvegicus (Rat)
Description:
P15207
Residue:
902
  
Inhibitor
Name:
BDBM180896
Synonyms:
US9133182, Example 25
Type:
Small organic molecule
Emp. Form.:
C14H11F6N3O2
Mol. Mass.:
367.2465
SMILES:
CN1C[C@H]([C@H](O)C(F)(F)F)N(C1=O)c1ccc(C#N)c(c1)C(F)(F)F
: