Target
Androgen receptor
Ligand
BDBM180901
Substrate
Meas. Tech.
Biological Assay
IC50
491±n/a nM
Citation
 Miller, CP Selective androgen receptor modulators US Patent  US9133182 Publication Date 9/15/2015 
Target
Name:
Androgen receptor
Synonyms:
ANDR_RAT Ar Nr3c4 | androgen
Type:
Enzyme
Mol. Mass.:
98219.08
Organism:
Rattus norvegicus (Rat)
Description:
P15207
Residue:
902
  
Inhibitor
Name:
BDBM180901
Synonyms:
US9133182, Example 30
Type:
Small organic molecule
Emp. Form.:
C14H12ClF3N2O2
Mol. Mass.:
332.705
SMILES:
Cc1c(Cl)c(ccc1N1[C@H](CCC1=O)[C@@H](O)C(F)(F)F)C#N
: