Target
Androgen receptor
Ligand
BDBM180903
Substrate
Meas. Tech.
Biological Assay
IC50
65±n/a nM
Citation
 Miller, CP Selective androgen receptor modulators US Patent  US9133182 Publication Date 9/15/2015 
Target
Name:
Androgen receptor
Synonyms:
ANDR_RAT Ar Nr3c4 | androgen
Type:
Enzyme
Mol. Mass.:
98219.08
Organism:
Rattus norvegicus (Rat)
Description:
P15207
Residue:
902
  
Inhibitor
Name:
BDBM180903
Synonyms:
US9133182, Example 33
Type:
Small organic molecule
Emp. Form.:
C13H10ClF3N2O2
Mol. Mass.:
318.679
SMILES:
O[C@H]([C@H]1CCC(=O)N1c1ccc(C#N)c(Cl)c1)C(F)(F)F
: