Target
Androgen receptor
Ligand
BDBM180907
Substrate
Meas. Tech.
Biological Assay
IC50
>1000±n/a nM
Citation
 Miller, CP Selective androgen receptor modulators US Patent  US9133182 Publication Date 9/15/2015 
Target
Name:
Androgen receptor
Synonyms:
ANDR_RAT Ar Nr3c4 | androgen
Type:
Enzyme
Mol. Mass.:
98219.08
Organism:
Rattus norvegicus (Rat)
Description:
P15207
Residue:
902
  
Inhibitor
Name:
BDBM180907
Synonyms:
US9133182, Example 37
Type:
Small organic molecule
Emp. Form.:
C14H10F6N2O3
Mol. Mass.:
368.2312
SMILES:
C[C@H]1OC(=O)N([C@H]1[C@@H](O)C(F)(F)F)c1ccc(C#N)c(c1)C(F)(F)F
: