Target
Prostaglandin E synthase 2
Ligand
BDBM181965
Substrate
Meas. Tech.
Biochemical Assay
pH
6.8±n/a
IC50
630±n/a nM
Comments
extracted
Citation
 Bylund, JEk, MEGravenfors, YNordvall, GMinidis, AVallin, KSViklund, JHolenz, JVon Berg, SSohn, D Bis-(sulfonylamino) derivatives for use in therapy US Patent  US9145380 Publication Date 9/29/2015 
Target
Name:
Prostaglandin E synthase 2
Synonyms:
C9orf15 PGES2_HUMAN | PTGES2
Type:
Enzyme
Mol. Mass.:
41955.21
Organism:
Homo sapiens (Human)
Description:
Q9H7Z7
Residue:
377
  
Inhibitor
Name:
BDBM181965
Synonyms:
US9145380, 168
Type:
Small organic molecule
Emp. Form.:
C17H14ClN3O4S2
Mol. Mass.:
423.894
SMILES:
NS(=O)(=O)c1ccccc1NS(=O)(=O)c1cccc(c1)-c1cncc(Cl)c1
: