Target
Prostaglandin E synthase 2
Ligand
BDBM181970
Substrate
Meas. Tech.
Biochemical Assay
pH
6.8±n/a
IC50
1500±n/a nM
Comments
extracted
Citation
 Bylund, JEk, MEGravenfors, YNordvall, GMinidis, AVallin, KSViklund, JHolenz, JVon Berg, SSohn, D Bis-(sulfonylamino) derivatives for use in therapy US Patent  US9145380 Publication Date 9/29/2015 
Target
Name:
Prostaglandin E synthase 2
Synonyms:
C9orf15 PGES2_HUMAN | PTGES2
Type:
Enzyme
Mol. Mass.:
41955.21
Organism:
Homo sapiens (Human)
Description:
Q9H7Z7
Residue:
377
  
Inhibitor
Name:
BDBM181970
Synonyms:
US9145380, 173
Type:
Small organic molecule
Emp. Form.:
C18H14Cl2N2O4S2
Mol. Mass.:
457.351
SMILES:
NS(=O)(=O)c1ccccc1NS(=O)(=O)c1ccc(cc1)-c1ccc(Cl)c(Cl)c1
: