Target
Prostaglandin E synthase 2
Ligand
BDBM181976
Substrate
Meas. Tech.
Biochemical Assay
pH
6.8±n/a
IC50
6200±n/a nM
Comments
extracted
Citation
 Bylund, JEk, MEGravenfors, YNordvall, GMinidis, AVallin, KSViklund, JHolenz, JVon Berg, SSohn, D Bis-(sulfonylamino) derivatives for use in therapy US Patent  US9145380 Publication Date 9/29/2015 
Target
Name:
Prostaglandin E synthase 2
Synonyms:
C9orf15 PGES2_HUMAN | PTGES2
Type:
Enzyme
Mol. Mass.:
41955.21
Organism:
Homo sapiens (Human)
Description:
Q9H7Z7
Residue:
377
  
Inhibitor
Name:
BDBM181976
Synonyms:
US9145380, 179
Type:
Small organic molecule
Emp. Form.:
C20H21BrN2O6S2
Mol. Mass.:
529.425
SMILES:
COc1ccc(Br)cc1\C=C\S(=O)(=O)Nc1ccc(cc1S(N)(=O)=O)C#CC(C)(C)O
: