Target
Prostaglandin E synthase 2
Ligand
BDBM181989
Substrate
Meas. Tech.
Biochemical Assay
pH
6.8±n/a
IC50
3200±n/a nM
Comments
extracted
Citation
 Bylund, JEk, MEGravenfors, YNordvall, GMinidis, AVallin, KSViklund, JHolenz, JVon Berg, SSohn, D Bis-(sulfonylamino) derivatives for use in therapy US Patent  US9145380 Publication Date 9/29/2015 
Target
Name:
Prostaglandin E synthase 2
Synonyms:
C9orf15 PGES2_HUMAN | PTGES2
Type:
Enzyme
Mol. Mass.:
41955.21
Organism:
Homo sapiens (Human)
Description:
Q9H7Z7
Residue:
377
  
Inhibitor
Name:
BDBM181989
Synonyms:
US9145380, 192
Type:
Small organic molecule
Emp. Form.:
C15H13F3N2O4S2
Mol. Mass.:
406.4
SMILES:
NS(=O)(=O)c1ccccc1NS(=O)(=O)\C=C\c1cccc(c1)C(F)(F)F
: